установил tinymce, Grappelli, Pillow, FileBrowser.

INSTALLED_APPS = (

'grappelli',
'filebrowser',
'django.contrib.admin',

)

from filebrowser.sites import site

urlpatterns = patterns('',

(r'^admin/filebrowser/', include(site.urls)),

(r'^grappelli/', include('grappelli.urls')),

(r'^admin/', include(admin.site.urls)), )

При запуске python manage.py test filebrowser:

Сорри, не знаю где соль, скопировал все:

ERROR: filebrowser.tests.test_base (unittest.loader.ModuleImportFailure)

Traceback (most recent call last): File "C:\Python33\lib\unittest\case.py", line 384, in _executeTestPart function() File "C:\Python33\lib\unittest\loader.py", line 32, in testFailure raise exception ImportError: Failed to import test module: filebrowser.tests.test_base Traceback (most recent call last): File "C:\Python33\lib\unittest\loader.py", line 261, in _find_tests module = self._get_module_from_name(name) File "C:\Python33\lib\unittest\loader.py", line 239, in _get_module_from_name import(name) File "C:\Python33\lib\site-packages\filebrowser\tests__init__.py", line 3, in <module> from filebrowser.tests.test_sites import * File "C:\Python33\lib\site-packages\filebrowser\tests\test_sites.py", line 425, in <module> all_sites = get_resolver(get_urlconf()).app_dict[APP_NAME] KeyError: 'filebrowser'

====================================================================== ERROR: filebrowser.tests.test_commands (unittest.loader.ModuleImportFailure)


Traceback (most recent call last): File "C:\Python33\lib\unittest\case.py", line 384, in _executeTestPart function() File "C:\Python33\lib\unittest\loader.py", line 32, in testFailure raise exception ImportError: Failed to import test module: filebrowser.tests.test_commands Traceback (most recent call last): File "C:\Python33\lib\unittest\loader.py", line 261, in _find_tests module = self._get_module_from_name(name) File "C:\Python33\lib\unittest\loader.py", line 239, in _get_module_from_name import(name) File "C:\Python33\lib\site-packages\filebrowser\tests__init__.py", line 3, in <module> from filebrowser.tests.test_sites import * File "C:\Python33\lib\site-packages\filebrowser\tests\test_sites.py", line 425, in <module> all_sites = get_resolver(get_urlconf()).app_dict[APP_NAME] KeyError: 'filebrowser'

====================================================================== ERROR: filebrowser.tests.test_forms (unittest.loader.ModuleImportFailure)


Traceback (most recent call last): File "C:\Python33\lib\unittest\case.py", line 384, in _executeTestPart function() File "C:\Python33\lib\unittest\loader.py", line 32, in testFailure raise exception ImportError: Failed to import test module: filebrowser.tests.test_forms Traceback (most recent call last): File "C:\Python33\lib\unittest\loader.py", line 261, in _find_tests module = self._get_module_from_name(name) File "C:\Python33\lib\unittest\loader.py", line 239, in _get_module_from_name import(name) File "C:\Python33\lib\site-packages\filebrowser\tests__init__.py", line 3, in <module> from filebrowser.tests.test_sites import * File "C:\Python33\lib\site-packages\filebrowser\tests\test_sites.py", line 425, in <module> all_sites = get_resolver(get_urlconf()).app_dict[APP_NAME] KeyError: 'filebrowser'

====================================================================== ERROR: filebrowser.tests.test_sites (unittest.loader.ModuleImportFailure)


Traceback (most recent call last): File "C:\Python33\lib\unittest\case.py", line 384, in _executeTestPart function() File "C:\Python33\lib\unittest\loader.py", line 32, in testFailure raise exception ImportError: Failed to import test module: filebrowser.tests.test_sites Traceback (most recent call last): File "C:\Python33\lib\unittest\loader.py", line 261, in _find_tests module = self._get_module_from_name(name) File "C:\Python33\lib\unittest\loader.py", line 239, in _get_module_from_name import(name) File "C:\Python33\lib\site-packages\filebrowser\tests__init__.py", line 3, in <module> from filebrowser.tests.test_sites import * File "C:\Python33\lib\site-packages\filebrowser\tests\test_sites.py", line 425, in <module> all_sites = get_resolver(get_urlconf()).app_dict[APP_NAME] KeyError: 'filebrowser'

====================================================================== ERROR: filebrowser.tests.test_templatetags (unittest.loader.ModuleImportFailure)


Traceback (most recent call last): File "C:\Python33\lib\unittest\case.py", line 384, in _executeTestPart function() File "C:\Python33\lib\unittest\loader.py", line 32, in testFailure raise exception ImportError: Failed to import test module: filebrowser.tests.test_templatetags Traceback (most recent call last): File "C:\Python33\lib\unittest\loader.py", line 261, in _find_tests module = self._get_module_from_name(name) File "C:\Python33\lib\unittest\loader.py", line 239, in _get_module_from_name import(name) File "C:\Python33\lib\site-packages\filebrowser\tests__init__.py", line 3, in <module> from filebrowser.tests.test_sites import * File "C:\Python33\lib\site-packages\filebrowser\tests\test_sites.py", line 425, in <module> all_sites = get_resolver(get_urlconf()).app_dict[APP_NAME] KeyError: 'filebrowser'

====================================================================== ERROR: filebrowser.tests.test_versions (unittest.loader.ModuleImportFailure)


Traceback (most recent call last): File "C:\Python33\lib\unittest\case.py", line 384, in _executeTestPart function() File "C:\Python33\lib\unittest\loader.py", line 32, in testFailure raise exception ImportError: Failed to import test module: filebrowser.tests.test_versions Traceback (most recent call last): File "C:\Python33\lib\unittest\loader.py", line 261, in _find_tests module = self._get_module_from_name(name) File "C:\Python33\lib\unittest\loader.py", line 239, in _get_module_from_name import(name) File "C:\Python33\lib\site-packages\filebrowser\tests__init__.py", line 3, in <module> from filebrowser.tests.test_sites import * File "C:\Python33\lib\site-packages\filebrowser\tests\test_sites.py", line 425, in <module> all_sites = get_resolver(get_urlconf()).app_dict[APP_NAME] KeyError: 'filebrowser'

====================================================================== FAIL: test_directory (filebrowser.tests.test_settings.SettingsTests)


Traceback (most recent call last): File "C:\Python33\lib\site-packages\filebrowser\tests\test_settings.py", line 29, in test_directory self.assertEqual(os.path.exists(os.path.join(MEDIA_ROOT, DIRECTORY)), 1) AssertionError: False != 1


Ran 21 tests in 0.055s

FAILED (failures=1, errors=6)